{"text_format":"1","workbook":"xlsx","n_sheets":10,"sheets":["年度更新について","試算","基本情報（毎年更新）","賦課試算","軽減計算","加入情報","給与所得計算","賦課額表示","年金所得計算","所得金額調整控除計算"],"not_rendered":{"charts":0,"images":2,"macros":1,"external_links":0,"defined_names":1,"comments":2,"pivot_tables":0},"unopened":[],"bounds":{"document_bytes":16777216,"sheet_cells":100000,"rows_first":2000,"rows_last":500,"rows_between":2000,"halvings":0,"cell_chars":16384,"cell_head_chars":4096},"cells_cut":0,"cells_raw":0,"read":"whole","date_system":"1900"}

{"sheet":"年度更新について","index":0,"n_rows":31,"n_cols":2,"rows_kept":31,"cut":false,"hidden":true,"merged":[]}
["年度更新について　R2.3.30塚本（R3.7追加修正）"]
[]
["更新が必要なシート（赤色）"]
[null,"①　試算（これだけ赤色にしていません）"]
[null,"②　軽減計算"]
[null,"③　給与所得計算"]
[null,"④　年金所得計算"]
[null,"⑤　基本情報（毎年更新）"]
{"$rows_left_out":24}
{"sheet":"試算","index":1,"n_rows":81,"n_cols":48,"rows_kept":81,"cut":false,"hidden":false,"merged":[[24,19,25,20],[21,19,23,20],[21,16,23,18],[24,16,25,18],[26,16,27,18],[28,16,29,18],[30,16,31,18],[21,21,23,22],[24,21,25,22],[26,21,27,22],[28,21,29,22],[30,21,31,22],[38,21,39,22],[38,23,39,24],[38,16,39,18],[26,19,27,20],[28,19,29,20],[30,19,31,20],[32,19,33,20],[34,19,35,20],[36,19,37,20],[38,19,39,20],[36,36,37,46],[36,47,37,57],[38,25,39,35],[38,36,39,46],[38,47,39,57],[30,36,31,46],[30,47,31,57],[32,25,33,35],[32,36,33,46],[32,47,33,57],[34,25,35,35],[34,36,35,46],[34,47,35,57],[30,25,31,35],[24,36,25,46],[24,47,25,57],[26,25,27,35],[26,36,27,46],[26,47,27,57],[28,25,29,35],[28,36,29,46],[28,47,29,57],[21,25,21,35],[22,25,23,35],[21,36,21,46],[22,36,23,46],[21,47,21,57],[22,47,23,57],[24,25,25,35],[38,5,39,6],[38,7,39,8],[38,9,39,9],[38,10,39,11],[38,12,39,12],[38,13,39,14],[38,15,39,15],[36,5,37,6],[36,7,37,8],[36,9,37,9],[36,10,37,11],[36,12,37,12],[36,13,37,14],[32,15,33,15],[34,5,35,6],[34,7,35,8],[34,9,35,9],[34,10,35,11],[34,12,35,12],[34,13,35,14],[34,15,35,15],[36,25,37,35],[32,5,33,6],[32,7,33,8],[32,9,33,9],[32,10,33,11],[32,12,33,12],[32,13,33,14],[36,23,37,24],[36,15,37,15],[36,16,37,18],[32,16,33,18],[34,16,35,18],[32,21,33,22],[34,21,35,22],[36,21,37,22],[30,7,31,8],[30,9,31,9],[30,10,31,11],[30,12,31,12],[30,13,31,14],[30,15,31,15],[28,5,29,6],[28,7,29,8],[28,9,29,9],[28,10,29,11],[28,12,29,12],[28,13,29,14],[0,0,0,2],[0,3,0,4],[24,1,25,1],[24,2,25,4],[26,1,27,1],[26,2,27,4],[21,1,23,4],[19,1,20,13],[19,14,20,22],[24,15,25,15],[26,5,27,6],[26,7,27,8],[26,9,27,9],[26,10,27,11],[26,12,27,12],[26,13,27,14],[26,15,27,15],[24,5,25,6],[24,7,25,8],[24,9,25,9],[24,10,25,11],[24,12,25,12],[24,13,25,14],[21,5,23,15],[40,23,40,24],[17,1,18,13],[17,14,18,22],[21,23,23,24],[24,23,25,24],[26,23,27,24],[28,23,29,24],[30,23,31,24],[32,23,33,24],[34,23,35,24],[28,2,29,4],[30,2,31,4],[32,2,33,4],[34,2,35,4],[36,2,37,4],[38,2,39,4],[28,1,29,1],[30,1,31,1],[32,1,33,1],[34,1,35,1],[36,1,37,1],[38,1,39,1],[28,15,29,15],[30,5,31,6],[42,1,43,6],[42,7,43,57],[41,23,41,24],[52,1,53,11],[52,12,53,30],[52,31,53,42],[52,43,53,54],[54,1,55,11],[54,12,55,30],[54,31,55,42],[54,43,55,54],[46,31,47,42],[46,43,47,54],[48,1,49,11],[48,12,49,30],[48,31,49,42],[48,43,49,54],[50,1,51,11],[50,12,51,30],[50,31,51,42],[50,43,51,54],[44,1,45,6],[46,1,47,11],[46,12,47,30],[44,7,45,11],[44,46,45,54],[44,39,45,45],[44,12,45,25],[44,26,45,38],[72,1,73,11],[72,12,73,30],[72,31,73,42],[72,43,73,54],[56,1,58,11],[56,12,58,30],[56,31,58,42],[56,43,58,54],[80,1,81,11],[80,12,81,30],[80,31,81,42],[80,43,81,54],[59,43,60,54],[59,1,60,20],[59,38,60,42],[70,1,71,11],[62,1,62,25],[74,1,75,11],[74,12,75,30],[74,31,75,42],[74,43,75,54],[76,1,77,11],[76,12,77,30],[76,31,77,42],[76,43,77,54],[78,1,79,11],[78,12,79,30],[78,31,79,42],[78,43,79,54],[59,25,60,37]]}
["令和",null,null,5,null,"年度　国保税額試算シート"]
[]
[null,"※次のような場合は、税額を計算することができませんので、直接窓口にてお尋ねください。"]
[null,null,"● 年度途中で国保に「加入」または「脱退」する世帯員がいる場合"]
[null,null,"● 年度途中に75歳になる国保加入者がいる場合"]
[null,null,"● 国保から後期高齢者医療制度に移行した世帯員がいる場合"]
[null,null,"● 分離課税の所得や専従者控除、専従者給与、純損失・雑損失の繰越控除などがある場合"]
[null,null,"● 非自発失業者に対する国保税の軽減措置の対象者がいる場合"]
{"$rows_left_out":74}
{"sheet":"基本情報（毎年更新）","index":2,"n_rows":25,"n_cols":14,"rows_kept":25,"cut":false,"hidden":true,"merged":[[0,1,0,4],[0,5,0,8],[0,9,0,12],[0,13,1,13],[0,0,1,0]]}
[null,"医療",null,null,null,"後期",null,null,null,"介護",null,null,null,"基礎控除額"]
[null,"所得割","均等割","平等割","限度額","所得割","均等割","平等割","限度額","所得割","均等割","平等割","限度額"]
["H28",9.6000000000000002E-2,24800,19200,540000,3.9E-2,6200,4800,190000,2.9000000000000001E-2,8000,5700,160000,330000]
["H29",9.6000000000000002E-2,24800,19200,540000,3.9E-2,6200,4800,190000,2.9000000000000001E-2,8000,5700,160000,330000]
["H30",0.106,29600,22000,580000,3.3000000000000002E-2,9300,6900,190000,2.7E-2,14900,0,160000,330000]
["R1",0.106,29600,22000,610000,3.3000000000000002E-2,9300,6900,190000,2.7E-2,14900,0,160000,330000]
["R2",0.106,29600,22000,630000,3.3000000000000002E-2,9300,6900,190000,2.7E-2,14900,0,170000,330000]
["R3",0.106,29600,22000,630000,3.3000000000000002E-2,9300,6900,190000,2.7E-2,14900,0,170000,430000]
{"$rows_left_out":18}
{"sheet":"賦課試算","index":3,"n_rows":187,"n_cols":47,"rows_kept":187,"cut":false,"hidden":true,"merged":[[152,3,154,3],[152,17,152,18],[152,21,152,22],[152,23,152,25],[152,26,152,28],[152,29,152,31],[152,32,152,34],[152,35,152,37],[152,38,152,40],[125,17,125,18],[125,21,125,22],[125,23,125,25],[125,26,125,28],[125,29,125,31],[125,32,125,34],[125,35,125,37],[125,38,125,40],[149,3,151,3],[149,17,149,18],[149,21,149,22],[149,23,149,25],[149,26,149,28],[149,29,149,31],[149,32,149,34],[149,35,149,37],[149,38,149,40],[140,17,140,18],[140,21,140,22],[140,23,140,25],[140,26,140,28],[140,29,140,31],[140,32,140,34],[140,35,140,37],[113,35,113,37],[113,38,113,40],[114,17,114,18],[114,19,114,20],[119,3,121,3],[119,17,119,18],[119,21,119,22],[134,35,134,37],[134,38,134,40],[119,23,119,25],[119,26,119,28],[119,29,119,31],[119,32,119,34],[119,35,119,37],[119,38,119,40],[122,3,124,3],[122,17,122,18],[122,21,122,22],[122,23,122,25],[122,26,122,28],[122,29,122,31],[122,32,122,34],[122,35,122,37],[122,38,122,40],[113,0,114,0],[113,1,113,3],[113,17,113,18],[113,19,113,20],[113,21,113,22],[113,23,113,25],[113,26,113,28],[113,29,113,31],[113,32,113,34],[129,17,129,18],[129,19,129,20],[134,3,136,3],[134,17,134,18],[134,21,134,22],[134,23,134,25],[134,26,134,28],[134,29,134,31],[134,32,134,34],[131,3,133,3],[131,17,131,18],[131,21,131,22],[131,23,131,25],[131,26,131,28],[131,29,131,31],[131,32,131,34],[128,17,128,18],[128,19,128,20],[128,21,128,22],[128,23,128,25],[128,26,128,28],[128,29,128,31],[128,32,128,34],[128,35,128,37],[128,38,128,40],[104,17,104,18],[104,21,104,22],[104,23,104,25],[104,26,104,28],[104,29,104,31],[104,32,104,34],[104,35,104,37],[104,38,104,40],[107,3,109,3],[107,17,107,18],[107,21,107,22],[107,23,107,25],[107,26,107,28],[107,29,107,31],[107,32,107,34],[107,35,107,37],[107,38,107,40],[89,17,89,18],[89,21,89,22],[89,23,89,25],[89,26,89,28],[89,29,89,31],[89,32,89,34],[89,35,89,37],[89,38,89,40],[92,3,94,3],[92,17,92,18],[92,21,92,22],[92,23,92,25],[92,26,92,28],[92,29,92,31],[92,32,92,34],[92,35,92,37],[92,38,92,40],[74,38,74,40],[77,3,79,3],[77,17,77,18],[77,21,77,22],[77,23,77,25],[77,26,77,28],[77,29,77,31],[77,32,77,34],[77,35,77,37],[77,38,77,40],[62,3,64,3],[62,17,62,18],[62,21,62,22],[62,23,62,25],[62,26,62,28],[62,29,62,31],[62,32,62,34],[62,35,62,37],[62,38,62,40],[47,17,47,18],[47,21,47,22],[47,23,47,25],[47,26,47,28],[47,29,47,31],[47,32,47,34],[47,35,47,37],[47,38,47,40],[59,17,59,18],[59,21,59,22],[59,23,59,25],[59,26,59,28],[59,29,59,31],[59,32,59,34],[59,35,59,37],[59,38,59,40],[29,26,29,28],[29,29,29,31],[29,32,29,34],[29,35,29,37],[29,38,29,40],[32,3,34,3],[32,17,32,18],[32,21,32,22],[32,23,32,25],[32,26,32,28],[32,29,32,31],[32,32,32,34],[32,35,32,37],[32,38,32,40],[4,0,4,8],[8,0,9,0],[23,0,24,0],[38,0,39,0],[53,0,54,0],[68,0,69,0],[83,0,84,0],[98,0,99,0],[143,0,144,0],[83,1,83,3],[50,3,52,3],[6,0,7,0],[17,3,19,3],[29,3,31,3],[44,3,46,3],[59,3,61,3],[74,3,76,3],[89,3,91,3],[104,3,106,3],[128,0,129,0],[128,1,128,3],[140,3,142,3],[125,3,127,3],[14,3,16,3],[185,23,185,25],[20,23,20,25],[183,21,183,22],[184,23,184,25],[184,21,184,22],[8,1,8,3],[8,17,8,18],[8,19,8,20],[8,21,8,22],[38,1,38,3],[38,17,38,18],[38,19,38,20],[38,21,38,22],[23,1,23,3],[23,17,23,18],[23,19,23,20],[20,3,22,3],[35,3,37,3],[143,19,143,20],[143,21,143,22],[98,1,98,3],[98,17,98,18],[98,19,98,20],[98,21,98,22],[184,29,184,31],[39,19,39,20],[54,19,54,20],[69,19,69,20],[84,19,84,20],[99,19,99,20],[144,19,144,20],[6,4,7,4],[6,1,7,3],[98,23,98,25],[143,23,143,25],[8,26,8,28],[23,26,23,28],[38,26,38,28],[53,26,53,28],[68,26,68,28],[7,23,7,25],[7,26,7,28],[35,23,35,25],[50,23,50,25],[65,23,65,25],[80,23,80,25],[95,23,95,25],[50,21,50,22],[183,32,183,34],[143,26,143,28],[155,21,155,22],[183,23,183,25],[68,17,68,18],[68,19,68,20],[68,21,68,22],[110,3,112,3],[155,3,157,3],[155,17,155,18],[143,1,143,3],[143,17,143,18],[80,3,82,3],[95,3,97,3],[80,32,80,34],[183,26,183,28],[143,29,143,31],[183,29,183,31],[110,29,110,31],[155,29,155,31],[110,26,110,28],[155,26,155,28],[110,23,110,25],[155,23,155,25],[2,1,2,3],[3,1,3,3],[7,32,7,34],[7,35,7,37],[7,38,7,40],[83,26,83,28],[98,26,98,28],[8,29,8,31],[23,29,23,31],[38,29,38,31],[53,29,53,31],[68,29,68,31],[83,29,83,31],[98,29,98,31],[53,23,53,25],[68,23,68,25],[83,23,83,25],[7,29,7,31],[8,23,8,25],[23,23,23,25],[2,10,2,12],[2,22,2,24],[53,1,53,3],[65,3,67,3],[186,21,186,22],[186,23,186,25],[9,17,9,18],[24,17,24,18],[39,17,39,18],[54,17,54,18],[69,17,69,18],[84,17,84,18],[99,17,99,18],[144,17,144,18],[10,17,10,18],[9,19,9,20],[20,17,20,18],[35,17,35,18],[50,17,50,18],[65,17,65,18],[80,17,80,18],[83,17,83,18],[83,19,83,20],[83,21,83,22],[95,21,95,22],[110,21,110,22],[95,17,95,18],[110,17,110,18],[95,29,95,31],[50,26,50,28],[65,26,65,28],[80,26,80,28],[95,26,95,28],[2,34,2,36],[20,32,20,34],[35,29,35,31],[2,31,2,33],[10,26,10,28],[20,26,20,28],[35,26,35,28],[23,32,23,34],[50,32,50,34],[65,32,65,34],[6,29,6,34],[6,35,6,40],[38,32,38,34],[53,32,53,34],[68,32,68,34],[83,32,83,34],[23,35,23,37],[23,38,23,40],[38,35,38,37],[0,46,0,48],[1,46,2,48],[83,35,83,37],[50,29,50,31],[65,29,65,31],[80,29,80,31],[0,10,0,21],[0,22,0,33],[0,34,0,45],[1,31,1,33],[1,43,1,45],[2,37,2,39],[2,40,2,42],[2,43,2,45],[1,28,1,30],[38,38,38,40],[8,35,8,37],[8,38,8,40],[1,10,1,12],[1,13,1,15],[17,29,17,31],[17,32,17,34],[17,35,17,37],[14,29,14,31],[1,16,1,18],[1,19,1,21],[1,22,1,24],[1,25,1,27],[23,21,23,22],[2,13,2,15],[2,16,2,18],[2,19,2,21],[2,25,2,27],[17,17,17,18],[17,21,17,22],[17,23,17,25],[17,26,17,28],[2,28,2,30],[6,23,6,28],[20,21,20,22],[6,19,6,20],[6,21,6,22],[7,19,7,20],[7,21,7,22],[14,17,14,18],[14,21,14,22],[14,23,14,25],[14,26,14,28],[38,23,38,25],[53,17,53,18],[53,19,53,20],[53,21,53,22],[65,21,65,22],[80,21,80,22],[68,1,68,3],[6,15,7,15],[6,5,7,5],[6,6,7,6],[6,7,7,7],[6,8,7,8],[6,9,7,9],[6,10,7,10],[6,11,7,11],[6,12,7,12],[6,13,7,13],[6,14,7,14],[29,17,29,18],[29,21,29,22],[29,23,29,25],[44,17,44,18],[44,21,44,22],[44,23,44,25],[110,35,110,37],[110,38,110,40],[155,35,155,37],[155,38,155,40],[53,35,53,37],[1,37,1,39],[1,40,1,42],[1,34,1,36],[8,32,8,34],[110,32,110,34],[155,32,155,34],[98,32,98,34],[143,32,143,34],[20,38,20,40],[35,35,35,37],[35,38,35,40],[50,35,50,37],[50,38,50,40],[65,35,65,37],[65,38,65,40],[80,35,80,37],[80,38,80,40],[17,38,17,40],[140,38,140,40],[183,35,183,37],[95,32,95,34],[20,29,20,31],[183,38,183,40],[184,35,184,37],[185,35,185,37],[186,35,186,37],[6,17,7,18],[6,16,7,16],[53,38,53,40],[68,35,68,37],[68,38,68,40],[98,35,98,37],[98,38,98,40],[83,38,83,40],[24,19,24,20],[35,32,35,34],[143,35,143,37],[143,38,143,40],[185,29,185,31],[186,29,186,31],[20,35,20,37],[95,35,95,37],[95,38,95,40],[9,21,9,22],[24,21,24,22],[39,21,39,22],[54,21,54,22],[69,21,69,22],[84,21,84,22],[99,21,99,22],[114,21,114,22],[129,21,129,22],[35,21,35,22],[74,21,74,22],[11,38,11,40],[26,3,28,3],[26,17,26,18],[26,21,26,22],[26,23,26,25],[26,26,26,28],[26,29,26,31],[26,32,26,34],[26,35,26,37],[26,38,26,40],[11,3,13,3],[11,17,11,18],[11,21,11,22],[11,23,11,25],[11,26,11,28],[11,29,11,31],[11,32,11,34],[11,35,11,37],[14,32,14,34],[14,35,14,37],[14,38,14,40],[41,38,41,40],[56,3,58,3],[56,17,56,18],[56,21,56,22],[56,23,56,25],[56,26,56,28],[56,29,56,31],[56,32,56,34],[56,35,56,37],[56,38,56,40],[41,3,43,3],[41,17,41,18],[41,21,41,22],[41,23,41,25],[41,26,41,28],[41,29,41,31],[41,32,41,34],[41,35,41,37],[44,26,44,28],[44,29,44,31],[44,32,44,34],[44,35,44,37],[44,38,44,40],[47,3,49,3],[71,35,71,37],[71,38,71,40],[86,3,88,3],[86,17,86,18],[86,21,86,22],[86,23,86,25],[86,26,86,28],[86,29,86,31],[86,32,86,34],[86,35,86,37],[86,38,86,40],[71,3,73,3],[71,17,71,18],[71,21,71,22],[71,23,71,25],[71,26,71,28],[71,29,71,31],[71,32,71,34],[74,17,74,18],[74,23,74,25],[74,26,74,28],[74,29,74,31],[74,32,74,34],[74,35,74,37],[101,3,103,3],[101,17,101,18],[101,21,101,22],[101,23,101,25],[101,26,101,28],[101,29,101,31],[101,32,101,34],[101,35,101,37],[101,38,101,40],[116,3,118,3],[116,17,116,18],[116,21,116,22],[116,23,116,25],[116,26,116,28],[116,29,116,31],[116,32,116,34],[116,35,116,37],[116,38,116,40],[131,35,131,37],[131,38,131,40],[146,3,148,3],[146,17,146,18],[146,21,146,22],[146,23,146,25],[146,26,146,28],[146,29,146,31],[146,32,146,34],[146,35,146,37],[146,38,146,40],[144,21,144,22],[137,29,137,31],[137,32,137,34],[137,35,137,37],[137,38,137,40],[137,3,139,3],[137,17,137,18],[137,21,137,22],[137,23,137,25],[137,26,137,28]]}
[{"$f":"\"R\"&試算!D1","v":"R5"},"年度　国保税計算表",null,null,null,null,null,null,null,null,"医　　　療",null,null,null,null,null,null,null,null,null,null,null,"後　　　期",null,null,null,null,null,null,null,null,null,null,null,"介　　　護",null,null,null,null,null,null,null,null,null,null,null,"基礎控除額"]
[null,null,null,null,null,null,null,null,null,null,"所得割",null,null,"均等割",null,null,"平等割",null,null,"限度額",null,null,"所得割",null,null,"均等割",null,null,"平等割",null,null,"限度額",null,null,"所得割",null,null,"均等割",null,null,"平等割",null,null,"限度額",null,null,{"$f":"VLOOKUP($A$1,'基本情報（毎年更新）'!$A$3:$N$50,14,0)","v":430000}]
[null,"軽減区分",null,null,null,null,null,null,null,null,{"$f":"VLOOKUP($A$1,'基本情報（毎年更新）'!$A$3:$M$50,2,0)","v":0.106},null,null,{"$f":"VLOOKUP($A$1,'基本情報（毎年更新）'!$A$3:$M$50,3,0)","v":29600},null,null,{"$f":"VLOOKUP($A$1,'基本情報（毎年更新）'!$A$3:$M$50,4,0)","v":22000},null,null,{"$f":"VLOOKUP($A$1,'基本情報（毎年更新）'!$A$3:$M$50,5,0)","v":650000},null,null,{"$f":"VLOOKUP($A$1,'基本情報（毎年更新）'!$A$3:$M$50,6,0)","v":3.3000000000000002E-2},null,null,{"$f":"VLOOKUP($A$1,'基本情報（毎年更新）'!$A$3:$M$50,7,0)","v":9300},null,null,{"$f":"VLOOKUP($A$1,'基本情報（毎年更新）'!$A$3:$M$50,8,0)","v":6900},null,null,{"$f":"VLOOKUP($A$1,'基本情報（毎年更新）'!$A$3:$M$50,9,0)","v":220000},null,null,{"$f":"VLOOKUP($A$1,'基本情報（毎年更新）'!$A$3:$M$50,10,0)","v":2.7E-2},null,null,{"$f":"VLOOKUP($A$1,'基本情報（毎年更新）'!$A$3:$M$50,11,0)","v":14900},null,null,{"$f":"VLOOKUP($A$1,'基本情報（毎年更新）'!$A$3:$M$50,12,0)","v":0},null,null,{"$f":"VLOOKUP($A$1,'基本情報（毎年更新）'!$A$3:$M$50,13,0)","v":170000},null,null,{"$f":"VLOOKUP($A$1,'基本情報（毎年更新）'!$A$3:$M$11,13,0)","v":170000}]
[null,{"$f":"軽減計算!J18","v":7}]
["医療欄の入力は以下の番号で入力\n（介護欄はすべて「１」で入力）\n１：主　２：擬主　３：員　４：擬同\n５：同　６：擬継　７：継　８：旧被扶\n※４～７は特定同一世帯に該当する場合のみ入力！"]
[null,null,null,null,"軽減",{"$f":"$B$4","v":7},{"$f":"$B$4","v":7},7,7,7,7,7,7,7,7,7,7]
["No.","所得額\n（基礎控除前）",null,null,null,4,5,6,7,8,9,10,11,12,1,2,3,"加入\n月数",null,"同",null,"旧被扶",null,"医療分",null,null,null,null,null,"後期分",null,null,null,null,null,"介護分"]
[null,null,null,null,null,4,5,6,7,8,9,10,11,12,1,null,null,null,null,"継",null,"未就学",null,"所得割",null,null,"均等割",null,null,"所得割",null,null,"均等割",null,null,"所得割",null,null,"均等割"]
{"$rows_left_out":180}
{"sheet":"軽減計算","index":4,"n_rows":18,"n_cols":17,"rows_kept":18,"cut":false,"hidden":true,"merged":[[17,6,17,8],[17,9,17,10],[15,2,15,3],[15,4,15,5],[15,6,15,8],[15,9,15,10],[16,9,16,10],[16,6,16,8],[13,2,13,3],[13,4,13,5],[13,6,13,8],[13,9,13,10],[14,2,14,3],[14,4,14,5],[14,6,14,8],[14,9,14,10],[11,2,11,3],[11,4,11,5],[11,6,11,8],[11,9,11,10],[12,2,12,3],[12,4,12,5],[12,6,12,8],[12,9,12,10],[9,2,9,3],[9,4,9,5],[9,6,9,8],[9,9,9,10],[10,2,10,3],[10,4,10,5],[10,6,10,8],[10,9,10,10],[7,2,7,3],[7,4,7,5],[7,6,7,8],[7,9,7,10],[8,2,8,3],[8,4,8,5],[8,6,8,8],[8,9,8,10]]}
[]
[null,null,"基準額",null,null,null,null,null,null,null,null,null,null,null,"基準額"]
["７割軽減",null,{"$f":"賦課試算!$AU$2","v":430000},"＋",100000,"×",{"$f":"IF(SUBTOTAL(9,$L$9:$L$16)=0,0,SUBTOTAL(9,$L$9:$L$16)-1)","v":0},"人",null,null,null,null,null,null,{"$f":"C3+E3*G3","v":430000}]
["５割軽減",null,{"$f":"賦課試算!$AU$2","v":430000},"＋",100000,"×",{"$f":"IF(SUBTOTAL(9,$L$9:$L$16)=0,0,SUBTOTAL(9,$L$9:$L$16)-1)","v":0},"人","＋",290000,"×",{"$f":"試算!$X$42","v":0},"人","＝",{"$f":"C4+J4*L4+E4*G4","v":430000}]
["２割軽減",null,{"$f":"賦課試算!$AU$2","v":430000},"＋",100000,"×",{"$f":"IF(SUBTOTAL(9,$L$9:$L$16)=0,0,SUBTOTAL(9,$L$9:$L$16)-1)","v":0},"人","＋",535000,"×",{"$f":"試算!$X$42","v":0},"人","＝",{"$f":"C5+J5*L5+E5*G5","v":430000}]
[]
[]
[null,"年齢","給与所得",null,"年金所得",null,"その他所得",null,null,"判定所得",null,null,null,null,"課税所得","前年度総所得","擬主"]
{"$rows_left_out":11}
{"sheet":"加入情報","index":5,"n_rows":30,"n_cols":22,"rows_kept":30,"cut":false,"hidden":true,"merged":[[0,0,0,1],[0,2,0,3],[6,0,8,0],[6,1,8,3],[9,0,11,0],[9,1,11,3],[5,0,5,3],[12,0,14,0],[12,1,14,3],[15,0,17,0],[15,1,17,3],[18,0,20,0],[18,1,20,3],[21,0,23,0],[21,1,23,3],[24,0,26,0],[24,1,26,3],[27,0,29,0],[27,1,29,3],[21,4,23,8],[24,4,26,8],[27,4,29,8],[2,19,2,21],[3,19,3,21],[2,15,2,16],[5,4,5,8],[6,4,8,8],[9,4,11,8],[12,4,14,8],[15,4,17,8],[18,4,20,8]]}
["令和",null,{"$f":"試算!D1","v":5},null,"年度　国保加入情報"]
[]
[null,null,null,null,null,null,null,null,null,null,null,null,null,null,null,"擬主適用",null,{"$f":"IF(試算!O20=\"はい\",0,1)","v":1},"加入月",{"$f":"T4+0","v":{"$error":"#VALUE!"}}]
[null,null,null,null,null,null,null,null,null,null,null,null,null,null,null,null,null,null,"加入日",{"$f":"IF(試算!O18<4,\"R\"&$C$1+1&\".\"&試算!O18&\".1\",\"R\"&$C$1&\".\"&試算!O18&\".1\")","v":"R6..1"}]
[null,null,null,null,null,null,null,null,null,null,{"$f":"\"R\"&$C$1&\".5.1\"","v":"R5.5.1"},{"$f":"\"R\"&$C$1&\".6.1\"","v":"R5.6.1"},{"$f":"\"R\"&$C$1&\".7.1\"","v":"R5.7.1"},{"$f":"\"R\"&$C$1&\".8.1\"","v":"R5.8.1"},{"$f":"\"R\"&$C$1&\".9.1\"","v":"R5.9.1"},{"$f":"\"R\"&$C$1&\".10.1\"","v":"R5.10.1"},{"$f":"\"R\"&$C$1&\".11.1\"","v":"R5.11.1"},{"$f":"\"R\"&$C$1&\".12.1\"","v":"R5.12.1"},{"$f":"\"R\"&$C$1+1&\".1.1\"","v":"R6.1.1"},{"$f":"\"R\"&$C$1+1&\".2.1\"","v":"R6.2.1"},{"$f":"\"R\"&$C$1+1&\".3.1\"","v":"R6.3.1"},{"$f":"\"R\"&$C$1+1&\".4.1\"","v":"R6.4.1"}]
[null,null,null,null,"生年月日",null,null,null,null,null,{"$f":"K5-1","v":"2023-04-30"},{"$f":"L5-1","v":"2023-05-31"},"2023-06-30","2023-07-31","2023-08-31","2023-09-30","2023-10-31","2023-11-30","2023-12-31","2024-01-31","2024-02-29","2024-03-31"]
[1,"世帯主",null,null,{"$f":"試算!Q25","v":"年月日"},null,null,null,null,"資格",{"$f":"IF(K8<75,\nIF(K$6<$T$3,0,\nIF($R$3=0,1,2)),2)","v":2},{"$f":"IF(L8<75,\nIF(L$6<$T$3,0,\nIF($R$3=0,1,2)),2)","v":2},2,2,2,2,2,2,2,2,2,2]
[null,null,null,null,null,null,null,null,null,"年齢",{"$f":"IFERROR(DATEDIF($E$7,K$6,\"Y\"),\"\")","v":""},{"$f":"IFERROR(DATEDIF($E$7,L$6,\"Y\"),\"\")","v":""},"","","","","","","","","",""]
{"$rows_left_out":23}
{"sheet":"給与所得計算","index":6,"n_rows":33,"n_cols":13,"rows_kept":33,"cut":false,"hidden":true,"merged":[[30,0,30,1],[0,0,1,6],[3,0,3,2],[31,0,31,1],[32,0,32,1],[24,0,24,1],[25,0,25,1],[26,0,26,1],[27,0,27,1],[28,0,28,1],[29,0,29,1]]}
["給与収入　→　給与所得"]
[]
[null,null,null,null,"世帯主","世帯員１","世帯員２","世帯員３","世帯員４","世帯員５","世帯員６","世帯員７"]
["Aの金額",null,null,"算出方法",{"$f":"C26","v":0},{"$f":"C27","v":0},{"$f":"C28","v":0},{"$f":"C29","v":0},{"$f":"C30","v":0},{"$f":"C31","v":0},{"$f":"C32","v":0},{"$f":"C33","v":0},"⇒給与収入"]
[0,"～",550999,"固定値(0)",{"$f":"IF(AND(E$4>=$A$5,E$4<=$C$5),0,\"\")","v":0},{"$f":"IF(AND(F$4>=$A$5,F$4<=$C$5),0,\"\")","v":0},0,0,0,0,0,0]
[{"$f":"C5+1","v":551000},"～",1618999,"A - 550,000",{"$f":"IF(AND(E$4>=$A$6,E$4<=$C$6),E$4-550000,\"\")","v":""},"","","","","","",""]
[{"$f":"C6+1","v":1619000},"～",{"$f":"C6+1000","v":1619999},"固定値(1,069,000)",{"$f":"IF(AND(E$4>=$A$7,E$4<=$C$7),1069000,\"\")","v":""},"","","","","","",""]
[1620000,"～",{"$f":"C7+2000","v":1621999},"固定値(1,070,000)",{"$f":"IF(AND(E$4>=$A$8,E$4<=$C$8),1070000,\"\")","v":""},"","","","","","",""]
{"$rows_left_out":26}
{"sheet":"賦課額表示","index":7,"n_rows":2,"n_cols":5,"rows_kept":2,"cut":false,"hidden":true,"merged":[]}
[{"$f":"賦課試算!A1&\"年度\"","v":"R5年度"},"医　療","後　期","介　護","合　計"]
["賦 課 額",{"$f":"賦課試算!X187","v":0},{"$f":"賦課試算!AD187","v":0},{"$f":"賦課試算!AJ187","v":0},{"$f":"SUM(B2:D2)","v":0}]

{"sheet":"年金所得計算","index":8,"n_rows":81,"n_cols":13,"rows_kept":81,"cut":false,"hidden":true,"merged":[[50,0,50,2],[61,0,61,2],[71,4,71,7],[4,0,4,2],[0,0,1,3],[15,0,15,2],[27,0,27,2],[38,0,38,2]]}
["年金収入　→　年金所得"]
[]
["〇公的年金等雑所得以外の所得に係る合計所得金額　1,000万円以下"]
["65歳未満",null,null,null,"世帯主","世帯員１","世帯員２","世帯員３","世帯員４","世帯員５","世帯員６","世帯員７"]
["Aの金額",null,null,"算出方法",{"$f":"C$74","v":0},{"$f":"C$75","v":0},{"$f":"C$76","v":0},{"$f":"C$77","v":0},{"$f":"C$78","v":0},{"$f":"C$79","v":0},{"$f":"C$80","v":0},{"$f":"C$81","v":0},"⇒年金収入"]
[0,"～",1300000,"A - 600,000",{"$f":"IF(AND(E$5>=$A$6,E$5<=$C$6),\n    IF(E$5-600000<0,0,E$5-600000),\"\")","v":0},0,0,0,0,0,0,0]
[{"$f":"C6+1","v":1300001},"～",4100000,"A × 0.75－275,000",{"$f":"IF(AND(E$5>=$A$7,E$5<=$C$7),E$5*0.75-275000,\"\")","v":""},"","","","","","",""]
[{"$f":"C7+1","v":4100001},"～",7700000,"A × 0.85－685,000",{"$f":"IF(AND(E$5>=$A$8,E$5<=$C$8),E$5*0.85-685000,\"\")","v":""},"","","","","","",""]
{"$rows_left_out":74}
{"sheet":"所得金額調整控除計算","index":9,"n_rows":11,"n_cols":8,"rows_kept":11,"cut":false,"hidden":true,"merged":[[1,4,1,7],[1,3,2,3],[3,0,3,1],[4,0,4,1],[5,0,5,1],[8,0,8,1],[9,0,9,1],[10,0,10,1],[1,0,2,1],[1,2,2,2],[6,0,6,1],[7,0,7,1]]}
["所得金額調整控除"]
[null,null,"給与所得","年金所得","所得金額調整控除計算"]
[null,null,null,null,"給与所得","年金所得","該当有無","所得金額調整控除額"]
["世帯主",null,{"$f":"給与所得計算!D26","v":0},{"$f":"年金所得計算!D74","v":0},{"$f":"IF(C4>=100000,100000,C4)","v":0},{"$f":"IF(D4>=100000,100000,D4)","v":0},{"$f":"IF(AND(E4>0,F4>0,E4+F4>=100000),\"有\",\"無\")","v":"無"},{"$f":"IF(G4=\"有\",E4+F4-100000,0)","v":0}]
["世帯員１",null,{"$f":"給与所得計算!D27","v":0},{"$f":"年金所得計算!D75","v":0},{"$f":"IF(C5>=100000,100000,C5)","v":0},{"$f":"IF(D5>=100000,100000,D5)","v":0},{"$f":"IF(AND(E5>0,F5>0,E5+F5>=100000),\"有\",\"無\")","v":"無"},{"$f":"IF(G5=\"有\",E5+F5-100000,0)","v":0}]
["世帯員２",null,{"$f":"給与所得計算!D28","v":0},{"$f":"年金所得計算!D76","v":0},0,0,"無",0]
["世帯員３",null,{"$f":"給与所得計算!D29","v":0},{"$f":"年金所得計算!D77","v":0},0,0,"無",0]
["世帯員４",null,{"$f":"給与所得計算!D30","v":0},{"$f":"年金所得計算!D78","v":0},0,0,"無",0]
{"$rows_left_out":3}